3-NO2-bicyclo[1.1.1]pentane-1-CO2 anion

Reaction thermochemistry data

Data compiled by: John E. Bartmess

Individual Reactions

C6H6NO4- + Hydrogen cation = C6H7NO4

By formula: C6H6NO4- + H+ = C6H7NO4

Quantity Value Units Method Reference Comment
Δr1389. ± 8.8kJ/molG+TSAdcock, Baran, et al., 2005gas phase; Entropy of acidity reassigned at 24 eu; authors did not take symmetry changes into account
Quantity Value Units Method Reference Comment
Δr1359. ± 8.4kJ/molCIDCAdcock, Baran, et al., 2005gas phase; Entropy of acidity reassigned at 24 eu; authors did not take symmetry changes into account

References

Adcock, Baran, et al., 2005
Adcock, W.; Baran, Y.; Filippi, A.; Speranza, M.; Trout, N.A., Polar substituent effects in the bicyclo[1.1.1]pentane ring system: Acidities of 3-substituted bicyclo[1.1.1]pentane-1-carboxylic acids, J. Org. Chem., 2005, 70, 3, 1029-1034, https://doi.org/10.1021/jo040236b . [all data]