3-Ph-bicyclo[1.1.1]pentane-1-CO2 anion

Gas phase ion energetics data

Data compiled by: John E. Bartmess

Electron affinity of neutral species

EAneutral (eV) Method Reference Comment
3.67 ± 0.13D-EAAdcock, Baran, et al., 2005Entropy of acidity reassigned at 24 eu; authors did not take symmetry changes into account

Protonation reactions

C12H11O2- + Hydrogen cation = C12H12O2

By formula: C12H11O2- + H+ = C12H12O2

Quantity Value Units Method Reference Comment
Δr1431. ± 8.8kJ/molG+TSAdcock, Baran, et al., 2005gas phase; Entropy of acidity reassigned at 24 eu; authors did not take symmetry changes into account
Quantity Value Units Method Reference Comment
Δr1401. ± 8.4kJ/molCIDCAdcock, Baran, et al., 2005gas phase; Entropy of acidity reassigned at 24 eu; authors did not take symmetry changes into account

References

Adcock, Baran, et al., 2005
Adcock, W.; Baran, Y.; Filippi, A.; Speranza, M.; Trout, N.A., Polar substituent effects in the bicyclo[1.1.1]pentane ring system: Acidities of 3-substituted bicyclo[1.1.1]pentane-1-carboxylic acids, J. Org. Chem., 2005, 70, 3, 1029-1034, https://doi.org/10.1021/jo040236b . [all data]