HO2C(CH2)3CO2 anion

Reaction thermochemistry data

Data compiled by: John E. Bartmess

Individual Reactions

C5H7O4- + Hydrogen cation = Pentanedioic acid

By formula: C5H7O4- + H+ = C5H8O4

Quantity Value Units Method Reference Comment
Δr1367. ± 8.4kJ/molCIDCKumar, Prabhakar, et al., 2005gas phase
Quantity Value Units Method Reference Comment
Δr1338. ± 8.4kJ/molCIDCKumar, Prabhakar, et al., 2005gas phase

References

Kumar, Prabhakar, et al., 2005
Kumar, M.R.; Prabhakar, S.; Nagaveni, V.; Vairamani, M., Estimation of gas-phase acidities of a series of dicarboxylic acids by the kinetic method, Rapid Commun. Mass Spectrom., 2005, 19, 8, 1053-1057, https://doi.org/10.1002/rcm.1888 . [all data]