NH radical anion
- Formula: HN-
- Molecular weight: 15.0152

Reaction thermochemistry data

Data compiled by: John E. Bartmess
Individual Reactions
Quantity | Value | Units | Method | Reference | Comment |
---|---|---|---|---|---|
ΔrH° | 1664.7 ± 2.0 | kJ/mol | D-EA | Neumark, Lykke, et al., 1985 | gas phase |
Quantity | Value | Units | Method | Reference | Comment |
ΔrG° | 1635.9 ± 2.4 | kJ/mol | H-TS | Neumark, Lykke, et al., 1985 | gas phase |

Gas phase ion energetics data

Data compiled by: John E. Bartmess
Protonation reactions
Quantity | Value | Units | Method | Reference | Comment |
---|---|---|---|---|---|
ΔrH° | 1664.7 ± 2.0 | kJ/mol | D-EA | Neumark, Lykke, et al., 1985 | gas phase |
Quantity | Value | Units | Method | Reference | Comment |
ΔrG° | 1635.9 ± 2.4 | kJ/mol | H-TS | Neumark, Lykke, et al., 1985 | gas phase |

References

Neumark, Lykke, et al., 1985
Neumark, D.M.; Lykke, K.R.; Anderson, T.; Lineberger, W.C.,
Infrared Spectrum and Autodetachment Dynamics of NH-,
J. Chem. Phys., 1985, 83, 9, 4364, https://doi.org/10.1063/1.449052
. [all data]