mCl-C6H4CH2O anion
- Formula: C7H6ClO-
- Molecular weight: 141.575

Reaction thermochemistry data

Data compiled by: John E. Bartmess
Individual Reactions
By formula: C7H6ClO- + H+ = C7H7ClO
Quantity | Value | Units | Method | Reference | Comment |
---|---|---|---|---|---|
ΔrH° | 1523. ± 8.8 | kJ/mol | G+TS | Mustanir, Than, et al., 2005 | gas phase |
Quantity | Value | Units | Method | Reference | Comment |
ΔrG° | 1495. ± 8.4 | kJ/mol | IMRE | Mustanir, Than, et al., 2005 | gas phase |
C7H6ClO- = C8H10ClO2-
By formula: C7H6ClO- = C8H10ClO2-
Quantity | Value | Units | Method | Reference | Comment |
---|---|---|---|---|---|
ΔrG° | 35.6 | kJ/mol | IMRE | Mustanir, Matsuoka, et al., 2006 | gas phase |

Gas phase ion energetics data

Data compiled by: John E. Bartmess
Electron affinity of neutral species
EAneutral (eV) | Method | Reference | Comment |
---|---|---|---|
2.33 ± 0.13 | D-EA | Mustanir, Than, et al., 2005 |
Protonation reactions
By formula: C7H6ClO- + H+ = C7H7ClO
Quantity | Value | Units | Method | Reference | Comment |
---|---|---|---|---|---|
ΔrH° | 1523. ± 8.8 | kJ/mol | G+TS | Mustanir, Than, et al., 2005 | gas phase |
Quantity | Value | Units | Method | Reference | Comment |
ΔrG° | 1495. ± 8.4 | kJ/mol | IMRE | Mustanir, Than, et al., 2005 | gas phase |

Ion clustering data

Data compiled by: John E. Bartmess
Clustering reactions
C7H6ClO- = C8H10ClO2-
By formula: C7H6ClO- = C8H10ClO2-
Quantity | Value | Units | Method | Reference | Comment |
---|---|---|---|---|---|
ΔrG° | 35.6 | kJ/mol | IMRE | Mustanir, Matsuoka, et al., 2006 | gas phase |

References

Mustanir, Than, et al., 2005
Mustanir; Than, S.; Mishima, M.,
Substituent effects on the gas phase acidity of phenylacetylenes and benzyl alcohols,
Bull. Chem. Soc. Japan, 2005, 78, 1, 147-153, https://doi.org/10.1246/bcsj.78.147
. [all data]
Mustanir, Matsuoka, et al., 2006
Mustanir; Matsuoka, M.; Mishima, M.; Koch, H.,
Stability of complexes of phenylacetylides and benzyl alkoxides with methanol in the gas phase. Acid-base correlation in the ionic hydrogen-bond strength,
Bull. Chem. Soc. Japan, 2006, 79, 7, 1118-1125, https://doi.org/10.1246/bcsj.79.1118
. [all data]