pCF3-C6H4CH2O anion

Gas phase ion energetics data

Data compiled by: John E. Bartmess

Electron affinity of neutral species

EAneutral (eV) Method Reference Comment
2.44 ± 0.13D-EAMustanir, Than, et al., 2005

Protonation reactions

C8H6F3O- + Hydrogen cation = 4-(Trifluoromethyl)benzyl alcohol

By formula: C8H6F3O- + H+ = C8H7F3O

Quantity Value Units Method Reference Comment
Δr1512. ± 8.8kJ/molG+TSMustanir, Than, et al., 2005gas phase
Quantity Value Units Method Reference Comment
Δr1484. ± 8.4kJ/molIMREMustanir, Than, et al., 2005gas phase

References

Mustanir, Than, et al., 2005
Mustanir; Than, S.; Mishima, M., Substituent effects on the gas phase acidity of phenylacetylenes and benzyl alcohols, Bull. Chem. Soc. Japan, 2005, 78, 1, 147-153, https://doi.org/10.1246/bcsj.78.147 . [all data]