pCF3-C6H4CðC anion

Reaction thermochemistry data

Data compiled by: John E. Bartmess

Individual Reactions

C9H4F3- = C10H8F3O-

By formula: C9H4F3- = C10H8F3O-

Quantity Value Units Method Reference Comment
Δr23.4kJ/molIMREMustanir, Matsuoka, et al., 2006gas phase

References

Mustanir, Matsuoka, et al., 2006
Mustanir; Matsuoka, M.; Mishima, M.; Koch, H., Stability of complexes of phenylacetylides and benzyl alkoxides with methanol in the gas phase. Acid-base correlation in the ionic hydrogen-bond strength, Bull. Chem. Soc. Japan, 2006, 79, 7, 1118-1125, https://doi.org/10.1246/bcsj.79.1118 . [all data]