C35 anion

Gas phase ion energetics data

Data compiled by: John E. Bartmess

Electron affinity of neutral species

EAneutral (eV) Method Reference Comment
3.90 ± 0.10LPESAchiba, Kohno, et al., 2005EA=Vertical Detachment Energy. Ring Structure likely.

References

Achiba, Kohno, et al., 2005
Achiba, Y.; Kohno, M.; Ohara, M.; Suzuki, S.; Shiromaru, H., Electron detachment spectroscopic study on carbon and silicon cluster anions, J. Electron Spectros. Rel. Phenom., 2005, 142, 3, 231-240, https://doi.org/10.1016/j.elspec.2004.09.016 . [all data]