CF3S anion

Reaction thermochemistry data

Data compiled by: John E. Bartmess

Individual Reactions

CF3S- + Hydrogen cation = Methanethiol, trifluoro-

By formula: CF3S- + H+ = CHF3S

Quantity Value Units Method Reference Comment
Δr1400. ± 9.6kJ/molG+TSKoppel, Pihl, et al., 1994gas phase; Possibly dissociative protonation -> CF2S + HF + A-. See CF3O-. G2: 321.0, Burk, Koppel, et al., 2000
Quantity Value Units Method Reference Comment
Δr1370. ± 8.4kJ/molIMREKoppel, Pihl, et al., 1994gas phase; Possibly dissociative protonation -> CF2S + HF + A-. See CF3O-. G2: 321.0, Burk, Koppel, et al., 2000

References

Koppel, Pihl, et al., 1994
Koppel, I.A.; Pihl, V.; Koppel, I.A.; Anvia, F.; Taft, R.W., Thermodynamic acidity of (CF3)3CH and 1H-undecafluorobicyclo[2.2.1]heptane: The concept of anionic (fluorine) hyperconjugation, J. Am. Chem. Soc., 1994, 116, 19, 8654, https://doi.org/10.1021/ja00098a027 . [all data]

Burk, Koppel, et al., 2000
Burk, P.; Koppel, I.A.; Rummel, A.; Trummal, A., Can O-H acid be more acidic than its S-H analog? A G2 study of fluoromethanols and fluoromethanethiols, J. Phys. Chem. A, 2000, 104, 7, 1602-1607, https://doi.org/10.1021/jp993487a . [all data]