Me3SnCl..Cl anion
- Formula: C3H9Cl2Sn-
- Molecular weight: 234.720

Ion clustering data

Data compiled by: John E. Bartmess
Clustering reactions
By formula: Cl- + C3H9ClSn = C3H9Cl2Sn-
Quantity | Value | Units | Method | Reference | Comment |
---|---|---|---|---|---|
ΔrH° | 31.3 ± 1.7 | kcal/mol | CIDT | Hao, Kaspar, et al., 2005 | gas phase |

Reaction thermochemistry data

Data compiled by: John E. Bartmess

Individual Reactions

Chlorine anion + Stannane, chlorotrimethyl- = C3H9Cl2Sn-

By formula: Cl- + C3H9ClSn = C3H9Cl2Sn-

Quantity Value Units Method Reference Comment
Δr131. ± 7.1kJ/molCIDTHao, Kaspar, et al., 2005gas phase

References

Hao, Kaspar, et al., 2005
Hao, C.T.; Kaspar, J.D.; Check, C.E.; Lobring, K.C.; Gilbert, T.M.; Sunderlin, L.S.,
Effect of substituents on the strength of A-Cl- (A = Si, Ge, and Sn) bonds in hypervalent systems: ACl(5)(-), ACl(4)F(-), and A(CH3)(3)Cl-2(-),
J. Phys. Chem. A, 2005, 109, 9, 2026-2034, https://doi.org/10.1021/jp040743x
. [all data]