OH..F anion
- Formula: FHO-
- Molecular weight: 36.0063

Gas phase thermochemistry data

Data compiled by: John E. Bartmess
Quantity | Value | Units | Method | Reference | Comment |
---|---|---|---|---|---|
ΔfH°gas | -347. ± 9.6 | kJ/mol | Ther | Deyerl and Continetti, 2005 | affinity at 0 K |

Ion clustering data

Data compiled by: John E. Bartmess
Clustering reactions
Quantity | Value | Units | Method | Reference | Comment |
---|---|---|---|---|---|
ΔrH° | 136. ± 9.6 | kJ/mol | LPES | Deyerl and Continetti, 2005 | gas phase; affinity at 0 K |

Reaction thermochemistry data

Data compiled by: John E. Bartmess

Individual Reactions

Fluorine anion + Hydroxyl radical = HFO-

By formula: F- + HO = HFO-

Quantity Value Units Method Reference Comment
Δr136. ± 9.6kJ/molLPESDeyerl and Continetti, 2005gas phase; affinity at 0 K

References

Deyerl and Continetti, 2005
Deyerl, H.J.; Continetti, R.E.,
Photoelectron-photofragment coincidence study of OHF-: transition state dynamics of the reaction OH+F - O+HF,
Phys. Chem. Chem. Phys., 2005, 7, 5, 855-860, https://doi.org/10.1039/b414604b
. [all data]