C78 dianion

Gas phase ion energetics data

Data compiled by: John E. Bartmess

Electron affinity of neutral species

EAneutral (eV) Method Reference Comment
0.600 ± 0.030LPESWang, Woo, et al., 2007C2v-prime isomer
0.440 ± 0.020LPESWang, Woo, et al., 2007C2v isomer
0.530 ± 0.020LPESWang, Woo, et al., 2007D3 isomer
0.15 ± 0.15LPESEhrler, Furche, et al., 2005Vertical Detachment Energy: 0.45±0.13 eV

References

Wang, Woo, et al., 2007
Wang, X.B.; Woo, H.K.; Yang, J.; Kappes, M.M.; Wang, L.S., Photoelectron spectroscopy of singly and doubly charged higher fullerenes at low temperatures: C-76(-), C-78(-), C-84(-) and C-76(2-), C-78(2-), C-84(2-), J. Phys. Chem. C, 2007, 111, 48, 17684-17689, https://doi.org/10.1021/jp0703861 . [all data]

Ehrler, Furche, et al., 2005
Ehrler, O.T.; Furche, F.; Weber, J.M.; Kappes, M.M., Photoelectron spectroscopy of fullerene dianions C-76(2-), C-78(2-), and C-84(2-), J. Chem. Phys., 2005, 122, 9, 094321, https://doi.org/10.1063/1.1859272 . [all data]