Mo2O4 radical anion

Gas phase ion energetics data

Data compiled by: John E. Bartmess

Electron affinity of neutral species

EAneutral (eV) Method Reference Comment
2.140 ± 0.040LPESYoder, Maze, et al., 2005

References

Yoder, Maze, et al., 2005
Yoder, B.L.; Maze, J.T.; Raghavachari, K.; Jarrold, C.C., Structures of Mo2Oy- and Mo2Oy (y=2, 3, and 4) studied by anion photoelectron spectroscopy and density functional theory calculations, J. Chem. Phys., 2005, 122, 9, 094313, https://doi.org/10.1063/1.1853379 . [all data]