nBuS anion

Reaction thermochemistry data

Data compiled by: John E. Bartmess

Individual Reactions

C4H9S- + Hydrogen cation = 1-Butanethiol

By formula: C4H9S- + H+ = C4H10S

Quantity Value Units Method Reference Comment
Δr1480. ± 9.2kJ/molG+TSTaft and Bordwell, 1988gas phase
Quantity Value Units Method Reference Comment
Δr1454. ± 8.4kJ/molIMRETaft and Bordwell, 1988gas phase

References

Taft and Bordwell, 1988
Taft, R.W.; Bordwell, F.G., Structural and Solvent Effects Evaluated from Acidities Measured in Dimethyl Sulfoxide and in the Gas Phase, Acc. Chem. Res., 1988, 21, 12, 463, https://doi.org/10.1021/ar00156a005 . [all data]