MeOD..F anion

Ion clustering data

Data compiled by: John E. Bartmess

Clustering reactions

Fluorine anion + Methyl Alcohol = CH3D4FO-

By formula: F- + CH4O = CH3D4FO-

Quantity Value Units Method Reference Comment
Δr125. ± 8.4kJ/molTDEqWilkinson, Szulejko, et al., 1992gas phase; Reported relative to ROH..F-, 0.5 kcal/mol weaker.
Quantity Value Units Method Reference Comment
Δr93.7 ± 8.4kJ/molTDEqWilkinson, Szulejko, et al., 1992gas phase; Reported relative to ROH..F-, 0.5 kcal/mol weaker.

Reaction thermochemistry data

Data compiled by: John E. Bartmess

Individual Reactions

Fluorine anion + Methyl Alcohol = CH3D4FO-

By formula: F- + CH4O = CH3D4FO-

Quantity Value Units Method Reference Comment
Δr29.8 ± 2.0kcal/molTDEqWilkinson, Szulejko, et al., 1992gas phase; Reported relative to ROH..F-, 0.5 kcal/mol weaker.
Quantity Value Units Method Reference Comment
Δr22.4 ± 2.0kcal/molTDEqWilkinson, Szulejko, et al., 1992gas phase; Reported relative to ROH..F-, 0.5 kcal/mol weaker.

References

Wilkinson, Szulejko, et al., 1992
Wilkinson, F.E.; Szulejko, J.E.; Allison, C.E.; Mcmahon, T.B., Fourier Transform Ion Cyclotron Resonance Investigation of the Deuterium Isotope Effect on Gas Phase Ion/Molecule Hydrogen Bonding Interactions in Alcohol-Fluoride Adduct Ions, Int. J. Mass Spectrom., 1992, 117, 487-505, https://doi.org/10.1016/0168-1176(92)80110-M . [all data]