iPrNHCOC(CO2Me)2 anion

Reaction thermochemistry data

Data compiled by: John E. Bartmess

Individual Reactions

C9H14NO5- + Hydrogen cation = C9H15NO5

By formula: C9H14NO5- + H+ = C9H15NO5

Quantity Value Units Method Reference Comment
Δr1418. ± 8.8kJ/molG+TSMishima, Matsuoka, et al., 2004gas phase; Calc: keto and enol forms of acid of equal stablity.
Quantity Value Units Method Reference Comment
Δr1386. ± 8.4kJ/molIMREMishima, Matsuoka, et al., 2004gas phase; Calc: keto and enol forms of acid of equal stablity.

References

Mishima, Matsuoka, et al., 2004
Mishima, M.; Matsuoka, M.; Lei, Y.X.; Rappoport, Z., Gas-phase acidities of disubstituted methanes and of enols of carboxamides substituted by electron-withdrawing groups, J. Org. Chem., 2004, 69, 18, 5947-5965, https://doi.org/10.1021/jo040196b . [all data]