(MeOH){H2O}2..Cl anion
- Formula: CH8ClO3-
- Molecular weight: 103.526

Gas phase thermochemistry data

Data compiled by: John E. Bartmess
Quantity | Value | Units | Method | Reference | Comment |
---|---|---|---|---|---|
ΔfH°gas | -1072.2 | kJ/mol | Ther | Evans and Keesee, 1991 |

Ion clustering data

Data compiled by: John E. Bartmess
Clustering reactions
H4ClO2- + + 2
= CH8ClO3-
By formula: H4ClO2- + CH4O + 2H2O = CH8ClO3-
Quantity | Value | Units | Method | Reference | Comment |
---|---|---|---|---|---|
ΔrH° | 43.51 ± 0.84 | kJ/mol | TDAs | Evans and Keesee, 1991 | gas phase |
ΔrH° | 47.7 ± 1.3 | kJ/mol | TDAs | Evans and Keesee, 1991 | gas phase; For solvation by MeOH of core ion |
Quantity | Value | Units | Method | Reference | Comment |
ΔrG° | 24.3 | kJ/mol | TDAs | Evans and Keesee, 1991 | gas phase |
ΔrG° | 25.1 | kJ/mol | TDAs | Evans and Keesee, 1991 | gas phase; For solvation by MeOH of core ion |

Reaction thermochemistry data

Data compiled by: John E. Bartmess

Individual Reactions

H4ClO2- + Methyl Alcohol + 2Water = CH8ClO3-

By formula: H4ClO2- + CH4O + 2H2O = CH8ClO3-

Quantity Value Units Method Reference Comment
Δr43.51 ± 0.84kJ/molTDAsEvans and Keesee, 1991gas phase
Δr47.7 ± 1.3kJ/molTDAsEvans and Keesee, 1991gas phase; For solvation by MeOH of core ion
Quantity Value Units Method Reference Comment
Δr24.3kJ/molTDAsEvans and Keesee, 1991gas phase
Δr25.1kJ/molTDAsEvans and Keesee, 1991gas phase; For solvation by MeOH of core ion

References

Evans and Keesee, 1991
Evans, D.H.; Keesee, R.G.,
Thermodynamics of Gas-Phase Mixed-Solvent Cluster Ions - Water and Methanol on K+ and Cl- and Comparison to Liquid Solutions,
J. Phys. Chem., 1991, 95, 9, 3558, https://doi.org/10.1021/j100162a024
. [all data]