(H2O)15..N3 anion
- Formula: H30N3O15-
- Molecular weight: 312.2498

Gas phase thermochemistry data

Data compiled by: John E. Bartmess
Quantity | Value | Units | Method | Reference | Comment |
---|---|---|---|---|---|
ΔfH°gas | -3693.6 | kJ/mol | Ther | Yang, Kiran, et al., 2004 | Affinity: EA change (H2O)n-1..N3- ion. Vertical Detachment Energy: 6.02±0.08 eV |

Ion clustering data

Data compiled by: John E. Bartmess
Clustering reactions
H28N3O14- + 15 = H30N3O15-
By formula: H28N3O14- + 15H2O = H30N3O15-
Quantity | Value | Units | Method | Reference | Comment |
---|---|---|---|---|---|
ΔrH° | 8.79 | kJ/mol | N/A | Yang, Kiran, et al., 2004 | gas phase; Affinity: EA change (H2O)n-1..N3- ion. Vertical Detachment Energy: 6.02±0.08 eV |
H30N3O15- + 16 = H32N3O16-
By formula: H30N3O15- + 16H2O = H32N3O16-
Quantity | Value | Units | Method | Reference | Comment |
---|---|---|---|---|---|
ΔrH° | 3.8 | kJ/mol | N/A | Yang, Kiran, et al., 2004 | gas phase; Affinity: EA change (H2O)n-1..N3- ion. Vertical Detachment Energy: 6.07±0.08 eV |

Reaction thermochemistry data

Data compiled by: John E. Bartmess

Individual Reactions

H28N3O14- + 15Water = H30N3O15-

By formula: H28N3O14- + 15H2O = H30N3O15-

Quantity Value Units Method Reference Comment
Δr8.79kJ/molN/AYang, Kiran, et al., 2004gas phase; Affinity: EA change (H2O)n-1..N3- ion. Vertical Detachment Energy: 6.02±0.08 eV

H30N3O15- + 16Water = H32N3O16-

By formula: H30N3O15- + 16H2O = H32N3O16-

Quantity Value Units Method Reference Comment
Δr3.8kJ/molN/AYang, Kiran, et al., 2004gas phase; Affinity: EA change (H2O)n-1..N3- ion. Vertical Detachment Energy: 6.07±0.08 eV

Gas phase ion energetics data

Data compiled by: John E. Bartmess

Electron affinity of neutral species

EAneutral (eV) Method Reference Comment
5.580 ± 0.080LPESYang, Kiran, et al., 2004Affinity: EA change (H2O)n-1..N3- ion. Vertical Detachment Energy: 6.02±0.08 eV

References

Yang, Kiran, et al., 2004
Yang, X.; Kiran, B.; Wang, X.B.; Wang, L.S.; Mucha, M.; Jungwirth, P.,
Solvation of the azide anion (N-3(-)) in water clusters and aqueous interfaces: A combined investigation by photoelectron spectroscopy, density functional calculations, and molecular dynamic,
J. Phys. Chem. A, 2004, 108, 39, 7820-7826, https://doi.org/10.1021/jp0496396
. [all data]