(H2O)12..N3 anion
- Formula: H24N3O12-
- Molecular weight: 258.2040

Gas phase thermochemistry data

Data compiled by: John E. Bartmess
Quantity | Value | Units | Method | Reference | Comment |
---|---|---|---|---|---|
ΔfH°gas | -2948.0 | kJ/mol | Ther | Yang, Kiran, et al., 2004 | Affinity: EA change (H2O)n-1..N3- ion. Vertical Detachment Energy: 5.79±0.08 eV |

Gas phase ion energetics data

Data compiled by: John E. Bartmess
Electron affinity of neutral species
EAneutral (eV) | Method | Reference | Comment |
---|---|---|---|
5.370 ± 0.080 | LPES | Yang, Kiran, et al., 2004 | Affinity: EA change (H2O)n-1..N3- ion. Vertical Detachment Energy: 5.79±0.08 eV |

Ion clustering data

Data compiled by: John E. Bartmess
Clustering reactions
H22N3O11- + 12 = H24N3O12-
By formula: H22N3O11- + 12H2O = H24N3O12-
Quantity | Value | Units | Method | Reference | Comment |
---|---|---|---|---|---|
ΔrH° | 2.9 | kJ/mol | N/A | Yang, Kiran, et al., 2004 | gas phase; Affinity: EA change (H2O)n-1..N3- ion. Vertical Detachment Energy: 5.79±0.08 eV |
H24N3O12- + 13 = H26N3O13-
By formula: H24N3O12- + 13H2O = H26N3O13-
Quantity | Value | Units | Method | Reference | Comment |
---|---|---|---|---|---|
ΔrH° | 7.53 | kJ/mol | N/A | Yang, Kiran, et al., 2004 | gas phase; Affinity: EA change (H2O)n-1..N3- ion. Vertical Detachment Energy: 5.89±0.08 eV |

Reaction thermochemistry data

Data compiled by: John E. Bartmess

Individual Reactions

H22N3O11- + 12Water = H24N3O12-

By formula: H22N3O11- + 12H2O = H24N3O12-

Quantity Value Units Method Reference Comment
Δr2.9kJ/molN/AYang, Kiran, et al., 2004gas phase; Affinity: EA change (H2O)n-1..N3- ion. Vertical Detachment Energy: 5.79±0.08 eV

H24N3O12- + 13Water = H26N3O13-

By formula: H24N3O12- + 13H2O = H26N3O13-

Quantity Value Units Method Reference Comment
Δr7.53kJ/molN/AYang, Kiran, et al., 2004gas phase; Affinity: EA change (H2O)n-1..N3- ion. Vertical Detachment Energy: 5.89±0.08 eV

References

Yang, Kiran, et al., 2004
Yang, X.; Kiran, B.; Wang, X.B.; Wang, L.S.; Mucha, M.; Jungwirth, P.,
Solvation of the azide anion (N-3(-)) in water clusters and aqueous interfaces: A combined investigation by photoelectron spectroscopy, density functional calculations, and molecular dynamic,
J. Phys. Chem. A, 2004, 108, 39, 7820-7826, https://doi.org/10.1021/jp0496396
. [all data]