(H2O)11..N3 anion
- Formula: H22N3O11-
- Molecular weight: 240.1887

Gas phase thermochemistry data

Data compiled by: John E. Bartmess
Quantity | Value | Units | Method | Reference | Comment |
---|---|---|---|---|---|
ΔfH°gas | -2703.3 | kJ/mol | Ther | Yang, Kiran, et al., 2004 | Affinity: EA change (H2O)n-1..N3- ion. Vertical Detachment Energy: 5.70±0.08 eV |

Ion clustering data

Data compiled by: John E. Bartmess
Clustering reactions
H20N3O10- + 11 = H22N3O11-
By formula: H20N3O10- + 11H2O = H22N3O11-
Quantity | Value | Units | Method | Reference | Comment |
---|---|---|---|---|---|
ΔrH° | 8.79 | kJ/mol | N/A | Yang, Kiran, et al., 2004 | gas phase; Affinity: EA change (H2O)n-1..N3- ion. Vertical Detachment Energy: 5.70±0.08 eV |
H22N3O11- + 12 = H24N3O12-
By formula: H22N3O11- + 12H2O = H24N3O12-
Quantity | Value | Units | Method | Reference | Comment |
---|---|---|---|---|---|
ΔrH° | 2.9 | kJ/mol | N/A | Yang, Kiran, et al., 2004 | gas phase; Affinity: EA change (H2O)n-1..N3- ion. Vertical Detachment Energy: 5.79±0.08 eV |

Gas phase ion energetics data

Data compiled by: John E. Bartmess
Electron affinity of neutral species
EAneutral (eV) | Method | Reference | Comment |
---|---|---|---|
5.340 ± 0.080 | LPES | Yang, Kiran, et al., 2004 | Affinity: EA change (H2O)n-1..N3- ion. Vertical Detachment Energy: 5.70±0.08 eV |

Reaction thermochemistry data

Data compiled by: John E. Bartmess

Individual Reactions

H20N3O10- + 11Water = H22N3O11-

By formula: H20N3O10- + 11H2O = H22N3O11-

Quantity Value Units Method Reference Comment
Δr8.79kJ/molN/AYang, Kiran, et al., 2004gas phase; Affinity: EA change (H2O)n-1..N3- ion. Vertical Detachment Energy: 5.70±0.08 eV

H22N3O11- + 12Water = H24N3O12-

By formula: H22N3O11- + 12H2O = H24N3O12-

Quantity Value Units Method Reference Comment
Δr2.9kJ/molN/AYang, Kiran, et al., 2004gas phase; Affinity: EA change (H2O)n-1..N3- ion. Vertical Detachment Energy: 5.79±0.08 eV

References

Yang, Kiran, et al., 2004
Yang, X.; Kiran, B.; Wang, X.B.; Wang, L.S.; Mucha, M.; Jungwirth, P.,
Solvation of the azide anion (N-3(-)) in water clusters and aqueous interfaces: A combined investigation by photoelectron spectroscopy, density functional calculations, and molecular dynamic,
J. Phys. Chem. A, 2004, 108, 39, 7820-7826, https://doi.org/10.1021/jp0496396
. [all data]