(H2O)10..N3 anion
- Formula: H20N3O10-
- Molecular weight: 222.1734

Gas phase thermochemistry data

Data compiled by: John E. Bartmess
Quantity | Value | Units | Method | Reference | Comment |
---|---|---|---|---|---|
ΔfH°gas | -2452.7 | kJ/mol | Ther | Yang, Kiran, et al., 2004 | Affinity: EA change from (H2O))n-1..N3- ion. Vertical Detachment Energy: 5.65±0.08 eV |

Ion clustering data

Data compiled by: John E. Bartmess
Clustering reactions
H18N3O9- + 10 = H20N3O10-
By formula: H18N3O9- + 10H2O = H20N3O10-
Quantity | Value | Units | Method | Reference | Comment |
---|---|---|---|---|---|
ΔrH° | 12.6 | kJ/mol | N/A | Yang, Kiran, et al., 2004 | gas phase; Affinity: EA change from (H2O))n-1..N3- ion. Vertical Detachment Energy: 5.65±0.08 eV |
H20N3O10- + 11 = H22N3O11-
By formula: H20N3O10- + 11H2O = H22N3O11-
Quantity | Value | Units | Method | Reference | Comment |
---|---|---|---|---|---|
ΔrH° | 8.79 | kJ/mol | N/A | Yang, Kiran, et al., 2004 | gas phase; Affinity: EA change (H2O)n-1..N3- ion. Vertical Detachment Energy: 5.70±0.08 eV |

References

Yang, Kiran, et al., 2004
Yang, X.; Kiran, B.; Wang, X.B.; Wang, L.S.; Mucha, M.; Jungwirth, P.,
Solvation of the azide anion (N-3(-)) in water clusters and aqueous interfaces: A combined investigation by photoelectron spectroscopy, density functional calculations, and molecular dynamic,
J. Phys. Chem. A, 2004, 108, 39, 7820-7826, https://doi.org/10.1021/jp0496396
. [all data]