(H2O)9..N3 anion
- Formula: H18N3O9-
- Molecular weight: 204.1582

Gas phase thermochemistry data

Data compiled by: John E. Bartmess
Quantity | Value | Units | Method | Reference | Comment |
---|---|---|---|---|---|
ΔfH°gas | -2198.3 | kJ/mol | Ther | Yang, Kiran, et al., 2004 | Affinity: EA change (H2O)n-1..N3- ion. Vertical Detachment Energy: 5.55±0.08 eV |

Ion clustering data

Data compiled by: John E. Bartmess
Clustering reactions
H16N3O8- + 9 = H18N3O9-
By formula: H16N3O8- + 9H2O = H18N3O9-
Quantity | Value | Units | Method | Reference | Comment |
---|---|---|---|---|---|
ΔrH° | 13.4 | kJ/mol | N/A | Yang, Kiran, et al., 2004 | gas phase; Affinity: EA change (H2O)n-1..N3- ion. Vertical Detachment Energy: 5.55±0.08 eV |
H18N3O9- + 10 = H20N3O10-
By formula: H18N3O9- + 10H2O = H20N3O10-
Quantity | Value | Units | Method | Reference | Comment |
---|---|---|---|---|---|
ΔrH° | 12.6 | kJ/mol | N/A | Yang, Kiran, et al., 2004 | gas phase; Affinity: EA change from (H2O))n-1..N3- ion. Vertical Detachment Energy: 5.65±0.08 eV |

Gas phase ion energetics data

Data compiled by: John E. Bartmess
Electron affinity of neutral species
EAneutral (eV) | Method | Reference | Comment |
---|---|---|---|
5.120 ± 0.080 | LPES | Yang, Kiran, et al., 2004 | Affinity: EA change (H2O)n-1..N3- ion. Vertical Detachment Energy: 5.55±0.08 eV |

Reaction thermochemistry data

Data compiled by: John E. Bartmess

Individual Reactions

H18N3O9- + 10Water = H20N3O10-

By formula: H18N3O9- + 10H2O = H20N3O10-

Quantity Value Units Method Reference Comment
Δr12.6kJ/molN/AYang, Kiran, et al., 2004gas phase; Affinity: EA change from (H2O))n-1..N3- ion. Vertical Detachment Energy: 5.65±0.08 eV

H16N3O8- + 9Water = H18N3O9-

By formula: H16N3O8- + 9H2O = H18N3O9-

Quantity Value Units Method Reference Comment
Δr13.4kJ/molN/AYang, Kiran, et al., 2004gas phase; Affinity: EA change (H2O)n-1..N3- ion. Vertical Detachment Energy: 5.55±0.08 eV

References

Yang, Kiran, et al., 2004
Yang, X.; Kiran, B.; Wang, X.B.; Wang, L.S.; Mucha, M.; Jungwirth, P.,
Solvation of the azide anion (N-3(-)) in water clusters and aqueous interfaces: A combined investigation by photoelectron spectroscopy, density functional calculations, and molecular dynamic,
J. Phys. Chem. A, 2004, 108, 39, 7820-7826, https://doi.org/10.1021/jp0496396
. [all data]