(H2O)8..N3 anion
- Formula: H16N3O8-
- Molecular weight: 186.1429

Gas phase thermochemistry data

Data compiled by: John E. Bartmess
Quantity | Value | Units | Method | Reference | Comment |
---|---|---|---|---|---|
ΔfH°gas | -1943.0 | kJ/mol | Ther | Yang, Kiran, et al., 2004 | Affinity: EA change (H2O)n-1..N3- ion. Vertical Detachment Energy: 5.42±0.08 eV |

Ion clustering data

Data compiled by: John E. Bartmess
Clustering reactions
H14N3O7- + 8 = H16N3O8-
By formula: H14N3O7- + 8H2O = H16N3O8-
Quantity | Value | Units | Method | Reference | Comment |
---|---|---|---|---|---|
ΔrH° | 13.4 | kJ/mol | N/A | Yang, Kiran, et al., 2004 | gas phase; Affinity: EA change (H2O)n-1..N3- ion. Vertical Detachment Energy: 5.42±0.08 eV |
H16N3O8- + 9 = H18N3O9-
By formula: H16N3O8- + 9H2O = H18N3O9-
Quantity | Value | Units | Method | Reference | Comment |
---|---|---|---|---|---|
ΔrH° | 13.4 | kJ/mol | N/A | Yang, Kiran, et al., 2004 | gas phase; Affinity: EA change (H2O)n-1..N3- ion. Vertical Detachment Energy: 5.55±0.08 eV |

Reaction thermochemistry data

Data compiled by: John E. Bartmess

Individual Reactions

H14N3O7- + 8Water = H16N3O8-

By formula: H14N3O7- + 8H2O = H16N3O8-

Quantity Value Units Method Reference Comment
Δr13.4kJ/molN/AYang, Kiran, et al., 2004gas phase; Affinity: EA change (H2O)n-1..N3- ion. Vertical Detachment Energy: 5.42±0.08 eV

H16N3O8- + 9Water = H18N3O9-

By formula: H16N3O8- + 9H2O = H18N3O9-

Quantity Value Units Method Reference Comment
Δr13.4kJ/molN/AYang, Kiran, et al., 2004gas phase; Affinity: EA change (H2O)n-1..N3- ion. Vertical Detachment Energy: 5.55±0.08 eV

Gas phase ion energetics data

Data compiled by: John E. Bartmess

Electron affinity of neutral species

EAneutral (eV) Method Reference Comment
4.980 ± 0.080LPESYang, Kiran, et al., 2004Affinity: EA change (H2O)n-1..N3- ion. Vertical Detachment Energy: 5.42±0.08 eV

References

Yang, Kiran, et al., 2004
Yang, X.; Kiran, B.; Wang, X.B.; Wang, L.S.; Mucha, M.; Jungwirth, P.,
Solvation of the azide anion (N-3(-)) in water clusters and aqueous interfaces: A combined investigation by photoelectron spectroscopy, density functional calculations, and molecular dynamic,
J. Phys. Chem. A, 2004, 108, 39, 7820-7826, https://doi.org/10.1021/jp0496396
. [all data]