(H2O)7..N3 anion
- Formula: H14N3O7-
- Molecular weight: 168.1276

Gas phase thermochemistry data

Data compiled by: John E. Bartmess
Quantity | Value | Units | Method | Reference | Comment |
---|---|---|---|---|---|
ΔfH°gas | -1687.8 | kJ/mol | Ther | Yang, Kiran, et al., 2004 | Affinity: EA change (H2O)n-1..N3- ion. Vertical Detachment Energy: 5.25±0.08 eV |

Ion clustering data

Data compiled by: John E. Bartmess
Clustering reactions
H12N3O6- + 7 = H14N3O7-
By formula: H12N3O6- + 7H2O = H14N3O7-
Quantity | Value | Units | Method | Reference | Comment |
---|---|---|---|---|---|
ΔrH° | 13.4 | kJ/mol | N/A | Yang, Kiran, et al., 2004 | gas phase; Affinity: EA change (H2O)n-1..N3- ion. Vertical Detachment Energy: 5.25±0.08 eV |
H14N3O7- + 8 = H16N3O8-
By formula: H14N3O7- + 8H2O = H16N3O8-
Quantity | Value | Units | Method | Reference | Comment |
---|---|---|---|---|---|
ΔrH° | 13.4 | kJ/mol | N/A | Yang, Kiran, et al., 2004 | gas phase; Affinity: EA change (H2O)n-1..N3- ion. Vertical Detachment Energy: 5.42±0.08 eV |

References

Yang, Kiran, et al., 2004
Yang, X.; Kiran, B.; Wang, X.B.; Wang, L.S.; Mucha, M.; Jungwirth, P.,
Solvation of the azide anion (N-3(-)) in water clusters and aqueous interfaces: A combined investigation by photoelectron spectroscopy, density functional calculations, and molecular dynamic,
J. Phys. Chem. A, 2004, 108, 39, 7820-7826, https://doi.org/10.1021/jp0496396
. [all data]