(H2O)6..N3 anion
- Formula: H12N3O6-
- Molecular weight: 150.1123

Gas phase thermochemistry data

Data compiled by: John E. Bartmess
Quantity | Value | Units | Method | Reference | Comment |
---|---|---|---|---|---|
ΔfH°gas | -1432.6 | kJ/mol | Ther | Yang, Kiran, et al., 2004 | Affinity: EA change (H2O)n-1..N3- ion. Vertical Detachment Energy: 5.03±0.08 eV |

Ion clustering data

Data compiled by: John E. Bartmess
Clustering reactions
H10N3O5- + 6 = H12N3O6-
By formula: H10N3O5- + 6H2O = H12N3O6-
Quantity | Value | Units | Method | Reference | Comment |
---|---|---|---|---|---|
ΔrH° | 15.5 | kJ/mol | N/A | Yang, Kiran, et al., 2004 | gas phase; Affinity: EA change (H2O)n-1..N3- ion. Vertical Detachment Energy: 5.03±0.08 eV |
H12N3O6- + 7 = H14N3O7-
By formula: H12N3O6- + 7H2O = H14N3O7-
Quantity | Value | Units | Method | Reference | Comment |
---|---|---|---|---|---|
ΔrH° | 13.4 | kJ/mol | N/A | Yang, Kiran, et al., 2004 | gas phase; Affinity: EA change (H2O)n-1..N3- ion. Vertical Detachment Energy: 5.25±0.08 eV |

Gas phase ion energetics data

Data compiled by: John E. Bartmess
Electron affinity of neutral species
EAneutral (eV) | Method | Reference | Comment |
---|---|---|---|
4.700 ± 0.080 | LPES | Yang, Kiran, et al., 2004 | Affinity: EA change (H2O)n-1..N3- ion. Vertical Detachment Energy: 5.03±0.08 eV |

Reaction thermochemistry data

Data compiled by: John E. Bartmess

Individual Reactions

H10N3O5- + 6Water = H12N3O6-

By formula: H10N3O5- + 6H2O = H12N3O6-

Quantity Value Units Method Reference Comment
Δr15.5kJ/molN/AYang, Kiran, et al., 2004gas phase; Affinity: EA change (H2O)n-1..N3- ion. Vertical Detachment Energy: 5.03±0.08 eV

H12N3O6- + 7Water = H14N3O7-

By formula: H12N3O6- + 7H2O = H14N3O7-

Quantity Value Units Method Reference Comment
Δr13.4kJ/molN/AYang, Kiran, et al., 2004gas phase; Affinity: EA change (H2O)n-1..N3- ion. Vertical Detachment Energy: 5.25±0.08 eV

References

Yang, Kiran, et al., 2004
Yang, X.; Kiran, B.; Wang, X.B.; Wang, L.S.; Mucha, M.; Jungwirth, P.,
Solvation of the azide anion (N-3(-)) in water clusters and aqueous interfaces: A combined investigation by photoelectron spectroscopy, density functional calculations, and molecular dynamic,
J. Phys. Chem. A, 2004, 108, 39, 7820-7826, https://doi.org/10.1021/jp0496396
. [all data]