(H2O)4..N3 anion
- Formula: H8N3O4-
- Molecular weight: 114.0818

Gas phase thermochemistry data

Data compiled by: John E. Bartmess
Quantity | Value | Units | Method | Reference | Comment |
---|---|---|---|---|---|
ΔfH°gas | -917.97 | kJ/mol | Ther | Yang, Kiran, et al., 2004 | Affinity: EA change (H2O)n-1..N3- ion. Vertical Detachment Energy: 4.63±0.06 eV |

Reaction thermochemistry data

Data compiled by: John E. Bartmess
Individual Reactions
H8N3O4- + 5 = H10N3O5-
By formula: H8N3O4- + 5H2O = H10N3O5-
Quantity | Value | Units | Method | Reference | Comment |
---|---|---|---|---|---|
ΔrH° | 15.5 | kJ/mol | N/A | Yang, Kiran, et al., 2004 | gas phase; Affinity: EA change from (H2O)n-1..N3- ion. Vertical Detachment Energy: 4.85±0.06 eV |
H6N3O3- + 4 = H8N3O4-
By formula: H6N3O3- + 4H2O = H8N3O4-
Quantity | Value | Units | Method | Reference | Comment |
---|---|---|---|---|---|
ΔrH° | 32.6 | kJ/mol | N/A | Yang, Kiran, et al., 2004 | gas phase; Affinity: EA change (H2O)n-1..N3- ion. Vertical Detachment Energy: 4.63±0.06 eV |

Gas phase ion energetics data

Data compiled by: John E. Bartmess
Electron affinity of neutral species
EAneutral (eV) | Method | Reference | Comment |
---|---|---|---|
4.380 ± 0.060 | LPES | Yang, Kiran, et al., 2004 | Affinity: EA change (H2O)n-1..N3- ion. Vertical Detachment Energy: 4.63±0.06 eV |

Ion clustering data

Data compiled by: John E. Bartmess
Clustering reactions
H6N3O3- + 4 = H8N3O4-
By formula: H6N3O3- + 4H2O = H8N3O4-
Quantity | Value | Units | Method | Reference | Comment |
---|---|---|---|---|---|
ΔrH° | 32.6 | kJ/mol | N/A | Yang, Kiran, et al., 2004 | gas phase; Affinity: EA change (H2O)n-1..N3- ion. Vertical Detachment Energy: 4.63±0.06 eV |
H8N3O4- + 5 = H10N3O5-
By formula: H8N3O4- + 5H2O = H10N3O5-
Quantity | Value | Units | Method | Reference | Comment |
---|---|---|---|---|---|
ΔrH° | 15.5 | kJ/mol | N/A | Yang, Kiran, et al., 2004 | gas phase; Affinity: EA change from (H2O)n-1..N3- ion. Vertical Detachment Energy: 4.85±0.06 eV |

References

Yang, Kiran, et al., 2004
Yang, X.; Kiran, B.; Wang, X.B.; Wang, L.S.; Mucha, M.; Jungwirth, P.,
Solvation of the azide anion (N-3(-)) in water clusters and aqueous interfaces: A combined investigation by photoelectron spectroscopy, density functional calculations, and molecular dynamic,
J. Phys. Chem. A, 2004, 108, 39, 7820-7826, https://doi.org/10.1021/jp0496396
. [all data]