(H2O)2..N3 anion
- Formula: H4N3O2-
- Molecular weight: 78.0512

Gas phase thermochemistry data

Data compiled by: John E. Bartmess
Quantity | Value | Units | Method | Reference | Comment |
---|---|---|---|---|---|
ΔfH°gas | -360. ± 380. | kJ/mol | Ther | Yang, Kiran, et al., 2004 | Affinity: EA change (H2O)n-1..N3- ion. Vertical Detachment Energy: 3.78±0.06 eV |

Ion clustering data

Data compiled by: John E. Bartmess
Clustering reactions
H2N3O- + 2 = H4N3O2-
By formula: H2N3O- + 2H2O = H4N3O2-
Quantity | Value | Units | Method | Reference | Comment |
---|---|---|---|---|---|
ΔrH° | 40. ± 390. | kJ/mol | N/A | Yang, Kiran, et al., 2004 | gas phase; Affinity: EA change (H2O)n-1..N3- ion. Vertical Detachment Energy: 3.78±0.06 eV |
H4N3O2- + 3 = H6N3O3-
By formula: H4N3O2- + 3H2O = H6N3O3-
Quantity | Value | Units | Method | Reference | Comment |
---|---|---|---|---|---|
ΔrH° | 44.35 | kJ/mol | N/A | Yang, Kiran, et al., 2004 | gas phase; Affinity: EA change (H2O)n-1..N3- ion. Vertical Detachment Energy: 4.25±0.06 eV |

References

Yang, Kiran, et al., 2004
Yang, X.; Kiran, B.; Wang, X.B.; Wang, L.S.; Mucha, M.; Jungwirth, P.,
Solvation of the azide anion (N-3(-)) in water clusters and aqueous interfaces: A combined investigation by photoelectron spectroscopy, density functional calculations, and molecular dynamic,
J. Phys. Chem. A, 2004, 108, 39, 7820-7826, https://doi.org/10.1021/jp0496396
. [all data]