H2O..N3 anion
- Formula: H2N3O-
- Molecular weight: 60.0359

Gas phase thermochemistry data

Data compiled by: John E. Bartmess
Quantity | Value | Units | Method | Reference | Comment |
---|---|---|---|---|---|
ΔfH°gas | -75. ± 75. | kJ/mol | Ther | Yang, Kiran, et al., 2004 | Affinity: EA change (H2O)n-1..N3- ion. Vertical Detachment Energy: 3.25±0.03 eV |

Ion clustering data

Data compiled by: John E. Bartmess
Clustering reactions
H2N3O- + 2 = H4N3O2-
By formula: H2N3O- + 2H2O = H4N3O2-
Quantity | Value | Units | Method | Reference | Comment |
---|---|---|---|---|---|
ΔrH° | 40. ± 390. | kJ/mol | N/A | Yang, Kiran, et al., 2004 | gas phase; Affinity: EA change (H2O)n-1..N3- ion. Vertical Detachment Energy: 3.78±0.06 eV |
By formula: N3- + H2O = H2N3O-
Quantity | Value | Units | Method | Reference | Comment |
---|---|---|---|---|---|
ΔrH° | 46. ± 75. | kJ/mol | N/A | Yang, Kiran, et al., 2004 | gas phase; Affinity: EA change (H2O)n-1..N3- ion. Vertical Detachment Energy: 3.25±0.03 eV |

Gas phase ion energetics data

Data compiled by: John E. Bartmess
Electron affinity of neutral species
EAneutral (eV) | Method | Reference | Comment |
---|---|---|---|
3.140 ± 0.060 | LPES | Yang, Kiran, et al., 2004 | Affinity: EA change (H2O)n-1..N3- ion. Vertical Detachment Energy: 3.25±0.03 eV |

Reaction thermochemistry data

Data compiled by: John E. Bartmess

Individual Reactions

Azide anion + Water = H2N3O-

By formula: N3- + H2O = H2N3O-

Quantity Value Units Method Reference Comment
Δr46. ± 75.kJ/molN/AYang, Kiran, et al., 2004gas phase; Affinity: EA change (H2O)n-1..N3- ion. Vertical Detachment Energy: 3.25±0.03 eV

H2N3O- + 2Water = H4N3O2-

By formula: H2N3O- + 2H2O = H4N3O2-

Quantity Value Units Method Reference Comment
Δr40. ± 390.kJ/molN/AYang, Kiran, et al., 2004gas phase; Affinity: EA change (H2O)n-1..N3- ion. Vertical Detachment Energy: 3.78±0.06 eV

References

Yang, Kiran, et al., 2004
Yang, X.; Kiran, B.; Wang, X.B.; Wang, L.S.; Mucha, M.; Jungwirth, P.,
Solvation of the azide anion (N-3(-)) in water clusters and aqueous interfaces: A combined investigation by photoelectron spectroscopy, density functional calculations, and molecular dynamic,
J. Phys. Chem. A, 2004, 108, 39, 7820-7826, https://doi.org/10.1021/jp0496396
. [all data]