trans-1,4-cyclohexandiolate anion

Gas phase ion energetics data

Data compiled by: John E. Bartmess

Protonation reactions

C6H11O2- + Hydrogen cation = 1,4-Cyclohexanediol, trans-

By formula: C6H11O2- + H+ = C6H12O2

Quantity Value Units Method Reference Comment
Δr1522. ± 8.4kJ/molIMREChen, Walthall, et al., 2004gas phase

Reaction thermochemistry data

Data compiled by: John E. Bartmess

Individual Reactions

C6H11O2- + Hydrogen cation = 1,4-Cyclohexanediol, trans-

By formula: C6H11O2- + H+ = C6H12O2

Quantity Value Units Method Reference Comment
Δr1522. ± 8.4kJ/molIMREChen, Walthall, et al., 2004gas phase

References

Chen, Walthall, et al., 2004
Chen, X.; Walthall, D.A.; Brauman, J.I., Acidities in cyclohexanediols enhanced by intramolecular hydrogen bonds, J. Am. Chem. Soc., 2004, 126, 39, 12614-12620, https://doi.org/10.1021/ja049780s . [all data]