Eu anion

Gas phase ion energetics data

Data compiled by: John E. Bartmess

Electron affinity of neutral species

EAneutral (eV) Method Reference Comment
1.053 ± 0.025LPDDavis and Thompson, 2004

References

Davis and Thompson, 2004
Davis, V.T.; Thompson, J.S., An experimental investigation of the atomic europium anion, J. Phys. B: Atom. Mol. Opt. Phys., 2004, 37, 9, 1961-1965, https://doi.org/10.1088/0953-4075/37/9/015 . [all data]