(MeNO2)4..MeNO2 anion
- Formula: C5H15N5O10-
- Molecular weight: 305.2006

Gas phase thermochemistry data

Data compiled by: John E. Bartmess
Quantity | Value | Units | Method | Reference | Comment |
---|---|---|---|---|---|
ΔfH°gas | -140. ± 35. | kcal/mol | Ther | Wincel, 2003 |

Ion clustering data

Data compiled by: John E. Bartmess
Clustering reactions
C4H12N4O8- + 4 = C5H15N5O10-
By formula: C4H12N4O8- + 4CH3NO2 = C5H15N5O10-
Quantity | Value | Units | Method | Reference | Comment |
---|---|---|---|---|---|
ΔrH° | 8.40 ± 0.20 | kcal/mol | TDAs | Wincel, 2003 | gas phase |
Quantity | Value | Units | Method | Reference | Comment |
ΔrG° | 2.40 | kcal/mol | TDAs | Wincel, 2003 | gas phase |

Reaction thermochemistry data

Data compiled by: John E. Bartmess

Individual Reactions

C4H12N4O8- + 4Methane, nitro- = C5H15N5O10-

By formula: C4H12N4O8- + 4CH3NO2 = C5H15N5O10-

Quantity Value Units Method Reference Comment
Δr8.40 ± 0.20kcal/molTDAsWincel, 2003gas phase
Quantity Value Units Method Reference Comment
Δr2.40kcal/molTDAsWincel, 2003gas phase

References

Wincel, 2003
Wincel, H.,
Gas-phase Solvation of Cl-, NO2-, CH2NO2-, CH3NO2-, and CH3NO4- by CH3NO2,
Int. J. Mass Spectrom., 2003, 226, 3, 341-353, https://doi.org/10.1016/S1387-3806(03)00066-6
. [all data]