(MeNO2)3..MeNO2 anion
- Formula: C4H12N4O8-
- Molecular weight: 244.1606

Gas phase thermochemistry data

Data compiled by: John E. Bartmess
Quantity | Value | Units | Method | Reference | Comment |
---|---|---|---|---|---|
ΔfH°gas | -480. ± 150. | kJ/mol | Ther | Wincel, 2003 |

Ion clustering data

Data compiled by: John E. Bartmess
Clustering reactions
C3H9N3O6- + 3 = C4H12N4O8-
By formula: C3H9N3O6- + 3CH3NO2 = C4H12N4O8-
Quantity | Value | Units | Method | Reference | Comment |
---|---|---|---|---|---|
ΔrH° | 43.5 ± 2.1 | kJ/mol | TDAs | Wincel, 2003 | gas phase |
Quantity | Value | Units | Method | Reference | Comment |
ΔrG° | 15.9 | kJ/mol | TDAs | Wincel, 2003 | gas phase |
C4H12N4O8- + 4 = C5H15N5O10-
By formula: C4H12N4O8- + 4CH3NO2 = C5H15N5O10-
Quantity | Value | Units | Method | Reference | Comment |
---|---|---|---|---|---|
ΔrH° | 35.1 ± 0.84 | kJ/mol | TDAs | Wincel, 2003 | gas phase |
Quantity | Value | Units | Method | Reference | Comment |
ΔrG° | 10.0 | kJ/mol | TDAs | Wincel, 2003 | gas phase |

Reaction thermochemistry data

Data compiled by: John E. Bartmess

Individual Reactions

C3H9N3O6- + 3Methane, nitro- = C4H12N4O8-

By formula: C3H9N3O6- + 3CH3NO2 = C4H12N4O8-

Quantity Value Units Method Reference Comment
Δr10.40 ± 0.50kcal/molTDAsWincel, 2003gas phase
Quantity Value Units Method Reference Comment
Δr3.80kcal/molTDAsWincel, 2003gas phase

C4H12N4O8- + 4Methane, nitro- = C5H15N5O10-

By formula: C4H12N4O8- + 4CH3NO2 = C5H15N5O10-

Quantity Value Units Method Reference Comment
Δr8.40 ± 0.20kcal/molTDAsWincel, 2003gas phase
Quantity Value Units Method Reference Comment
Δr2.40kcal/molTDAsWincel, 2003gas phase

References

Wincel, 2003
Wincel, H.,
Gas-phase Solvation of Cl-, NO2-, CH2NO2-, CH3NO2-, and CH3NO4- by CH3NO2,
Int. J. Mass Spectrom., 2003, 226, 3, 341-353, https://doi.org/10.1016/S1387-3806(03)00066-6
. [all data]