(MeNO2)4..NO2 anion
- Formula: C4H12N5O10-
- Molecular weight: 290.1661

Ion clustering data

Data compiled by: John E. Bartmess
Clustering reactions
C3H9N4O8- + 4 = C4H12N5O10-
By formula: C3H9N4O8- + 4CH3NO2 = C4H12N5O10-
Quantity | Value | Units | Method | Reference | Comment |
---|---|---|---|---|---|
ΔrH° | 40.6 ± 1.3 | kJ/mol | N/A | Wincel, 2003 | gas phase |
Quantity | Value | Units | Method | Reference | Comment |
ΔrG° | 6.69 | kJ/mol | TDAs | Wincel, 2003 | gas phase |

Gas phase thermochemistry data

Data compiled by: John E. Bartmess

Quantity Value Units Method Reference Comment
Δfgas-682.8 ± 5.0kJ/molTherWincel, 2003

Reaction thermochemistry data

Data compiled by: John E. Bartmess

Individual Reactions

C3H9N4O8- + 4Methane, nitro- = C4H12N5O10-

By formula: C3H9N4O8- + 4CH3NO2 = C4H12N5O10-

Quantity Value Units Method Reference Comment
Δr40.6 ± 1.3kJ/molN/AWincel, 2003gas phase
Quantity Value Units Method Reference Comment
Δr6.69kJ/molTDAsWincel, 2003gas phase

References

Wincel, 2003
Wincel, H.,
Gas-phase Solvation of Cl-, NO2-, CH2NO2-, CH3NO2-, and CH3NO4- by CH3NO2,
Int. J. Mass Spectrom., 2003, 226, 3, 341-353, https://doi.org/10.1016/S1387-3806(03)00066-6
. [all data]