(MeNO2)3..NO2 anion
- Formula: C3H9N4O8-
- Molecular weight: 229.1261

Gas phase thermochemistry data

Data compiled by: John E. Bartmess
Quantity | Value | Units | Method | Reference | Comment |
---|---|---|---|---|---|
ΔfH°gas | -135.7 ± 1.1 | kcal/mol | Ther | Wincel, 2003 |

Ion clustering data

Data compiled by: John E. Bartmess
Clustering reactions
C2H6N3O6- + 3 = C3H9N4O8-
By formula: C2H6N3O6- + 3CH3NO2 = C3H9N4O8-
Quantity | Value | Units | Method | Reference | Comment |
---|---|---|---|---|---|
ΔrH° | 11.30 ± 0.80 | kcal/mol | N/A | Wincel, 2003 | gas phase |
Quantity | Value | Units | Method | Reference | Comment |
ΔrG° | 3.30 | kcal/mol | TDAs | Wincel, 2003 | gas phase |
C3H9N4O8- + 4 = C4H12N5O10-
By formula: C3H9N4O8- + 4CH3NO2 = C4H12N5O10-
Quantity | Value | Units | Method | Reference | Comment |
---|---|---|---|---|---|
ΔrH° | 9.70 ± 0.30 | kcal/mol | N/A | Wincel, 2003 | gas phase |
Quantity | Value | Units | Method | Reference | Comment |
ΔrG° | 1.60 | kcal/mol | TDAs | Wincel, 2003 | gas phase |

Reaction thermochemistry data

Data compiled by: John E. Bartmess

Individual Reactions

C2H6N3O6- + 3Methane, nitro- = C3H9N4O8-

By formula: C2H6N3O6- + 3CH3NO2 = C3H9N4O8-

Quantity Value Units Method Reference Comment
Δr11.30 ± 0.80kcal/molN/AWincel, 2003gas phase
Quantity Value Units Method Reference Comment
Δr3.30kcal/molTDAsWincel, 2003gas phase

C3H9N4O8- + 4Methane, nitro- = C4H12N5O10-

By formula: C3H9N4O8- + 4CH3NO2 = C4H12N5O10-

Quantity Value Units Method Reference Comment
Δr9.70 ± 0.30kcal/molN/AWincel, 2003gas phase
Quantity Value Units Method Reference Comment
Δr1.60kcal/molTDAsWincel, 2003gas phase

References

Wincel, 2003
Wincel, H.,
Gas-phase Solvation of Cl-, NO2-, CH2NO2-, CH3NO2-, and CH3NO4- by CH3NO2,
Int. J. Mass Spectrom., 2003, 226, 3, 341-353, https://doi.org/10.1016/S1387-3806(03)00066-6
. [all data]