(MeNO2)2..NO2 anion
- Formula: C2H6N3O6-
- Molecular weight: 168.0861

Gas phase thermochemistry data

Data compiled by: John E. Bartmess
Quantity | Value | Units | Method | Reference | Comment |
---|---|---|---|---|---|
ΔfH°gas | -446.2 ± 3.1 | kJ/mol | Ther | Wincel, 2003 |

Ion clustering data

Data compiled by: John E. Bartmess
Clustering reactions
CH3N2O4- + 2 = C2H6N3O6-
By formula: CH3N2O4- + 2CH3NO2 = C2H6N3O6-
Quantity | Value | Units | Method | Reference | Comment |
---|---|---|---|---|---|
ΔrH° | 51.9 ± 2.1 | kJ/mol | N/A | Wincel, 2003 | gas phase |
Quantity | Value | Units | Method | Reference | Comment |
ΔrG° | 22.6 | kJ/mol | TDAs | Wincel, 2003 | gas phase |
C2H6N3O6- + 3 = C3H9N4O8-
By formula: C2H6N3O6- + 3CH3NO2 = C3H9N4O8-
Quantity | Value | Units | Method | Reference | Comment |
---|---|---|---|---|---|
ΔrH° | 47.3 ± 3.3 | kJ/mol | N/A | Wincel, 2003 | gas phase |
Quantity | Value | Units | Method | Reference | Comment |
ΔrG° | 13.8 | kJ/mol | TDAs | Wincel, 2003 | gas phase |

References

Wincel, 2003
Wincel, H.,
Gas-phase Solvation of Cl-, NO2-, CH2NO2-, CH3NO2-, and CH3NO4- by CH3NO2,
Int. J. Mass Spectrom., 2003, 226, 3, 341-353, https://doi.org/10.1016/S1387-3806(03)00066-6
. [all data]