(MeNO2)4..Cl anion
- Formula: C4H12ClN4O8-
- Molecular weight: 279.614

Gas phase thermochemistry data

Data compiled by: John E. Bartmess
Quantity | Value | Units | Method | Reference | Comment |
---|---|---|---|---|---|
ΔfH°gas | -735.42 | kJ/mol | Ther | Wincel, 2003 |

Ion clustering data

Data compiled by: John E. Bartmess
Clustering reactions
C3H9ClN3O6- + 4 = C4H12ClN4O8-
By formula: C3H9ClN3O6- + 4CH3NO2 = C4H12ClN4O8-
Quantity | Value | Units | Method | Reference | Comment |
---|---|---|---|---|---|
ΔrH° | 40. ± 4.2 | kJ/mol | N/A | Wincel, 2003 | gas phase |
Quantity | Value | Units | Method | Reference | Comment |
ΔrG° | 11.3 | kJ/mol | TDAs | Wincel, 2003 | gas phase |

Reaction thermochemistry data

Data compiled by: John E. Bartmess

Individual Reactions

C3H9ClN3O6- + 4Methane, nitro- = C4H12ClN4O8-

By formula: C3H9ClN3O6- + 4CH3NO2 = C4H12ClN4O8-

Quantity Value Units Method Reference Comment
Δr9.6 ± 1.0kcal/molN/AWincel, 2003gas phase
Quantity Value Units Method Reference Comment
Δr2.70kcal/molTDAsWincel, 2003gas phase

References

Wincel, 2003
Wincel, H.,
Gas-phase Solvation of Cl-, NO2-, CH2NO2-, CH3NO2-, and CH3NO4- by CH3NO2,
Int. J. Mass Spectrom., 2003, 226, 3, 341-353, https://doi.org/10.1016/S1387-3806(03)00066-6
. [all data]