(EtNO2)2..C2H4NO2 anion
- Formula: C6H14N3O6-
- Molecular weight: 224.1924

Gas phase thermochemistry data

Data compiled by: John E. Bartmess
Quantity | Value | Units | Method | Reference | Comment |
---|---|---|---|---|---|
ΔfH°gas | -114.7 ± 2.6 | kcal/mol | Ther | Wincel, 2004 |

Reaction thermochemistry data

Data compiled by: John E. Bartmess
Individual Reactions
C4H9N2O4- + 2 = C6H14N3O6-
By formula: C4H9N2O4- + 2C2H5NO2 = C6H14N3O6-
Quantity | Value | Units | Method | Reference | Comment |
---|---|---|---|---|---|
ΔrH° | 15.40 ± 0.80 | kcal/mol | TDAs | Wincel, 2004 | gas phase |
Quantity | Value | Units | Method | Reference | Comment |
ΔrG° | 6.20 | kcal/mol | TDAs | Wincel, 2004 | gas phase |

Ion clustering data

Data compiled by: John E. Bartmess
Clustering reactions
C4H9N2O4- + 2 = C6H14N3O6-
By formula: C4H9N2O4- + 2C2H5NO2 = C6H14N3O6-
Quantity | Value | Units | Method | Reference | Comment |
---|---|---|---|---|---|
ΔrH° | 15.40 ± 0.80 | kcal/mol | TDAs | Wincel, 2004 | gas phase |
Quantity | Value | Units | Method | Reference | Comment |
ΔrG° | 6.20 | kcal/mol | TDAs | Wincel, 2004 | gas phase |

References

Wincel, 2004
Wincel, H.,
Gas-phase clustering reactions of NO2-, C2H3NO2-, C2H4NO2-C2H5NO2- and C2H5NO4- with C2H5NO2,
Int. J. Mass Spectrom., 2004, 232, 2, 185-194, https://doi.org/10.1016/j.ijms.2004.01.003
. [all data]