EtNO2..C2H3NO2 anion
- Formula: C4H8N2O4-
- Molecular weight: 148.1179

Gas phase thermochemistry data

Data compiled by: John E. Bartmess
Quantity | Value | Units | Method | Reference | Comment |
---|---|---|---|---|---|
ΔfH°gas | -64.8 ± 3.7 | kcal/mol | Ther | Wincel, 2004 |

Ion clustering data

Data compiled by: John E. Bartmess
Clustering reactions
C2H3NO2- + = C4H8N2O4-
By formula: C2H3NO2- + C2H5NO2 = C4H8N2O4-
Quantity | Value | Units | Method | Reference | Comment |
---|---|---|---|---|---|
ΔrH° | 15.70 ± 0.80 | kcal/mol | TDAs | Wincel, 2004 | gas phase |
Quantity | Value | Units | Method | Reference | Comment |
ΔrG° | 8.50 | kcal/mol | TDAs | Wincel, 2004 | gas phase |
C4H8N2O4- + 2 = C6H13N3O6-
By formula: C4H8N2O4- + 2C2H5NO2 = C6H13N3O6-
Quantity | Value | Units | Method | Reference | Comment |
---|---|---|---|---|---|
ΔrH° | 15.20 ± 0.80 | kcal/mol | TDAs | Wincel, 2004 | gas phase |
Quantity | Value | Units | Method | Reference | Comment |
ΔrG° | 5.70 | kcal/mol | TDAs | Wincel, 2004 | gas phase |

References

Wincel, 2004
Wincel, H.,
Gas-phase clustering reactions of NO2-, C2H3NO2-, C2H4NO2-C2H5NO2- and C2H5NO4- with C2H5NO2,
Int. J. Mass Spectrom., 2004, 232, 2, 185-194, https://doi.org/10.1016/j.ijms.2004.01.003
. [all data]