(EtNO2)2..EtNO4 anion
- Formula: C6H15N3O8-
- Molecular weight: 257.1991

Reaction thermochemistry data

Data compiled by: John E. Bartmess
Individual Reactions
C4H10N2O6- + 2 = C6H15N3O8-
By formula: C4H10N2O6- + 2C2H5NO2 = C6H15N3O8-
Quantity | Value | Units | Method | Reference | Comment |
---|---|---|---|---|---|
ΔrH° | 53.1 ± 2.1 | kJ/mol | TDAs | Wincel, 2004 | gas phase |
Quantity | Value | Units | Method | Reference | Comment |
ΔrG° | 18.4 | kJ/mol | TDAs | Wincel, 2004 | gas phase |
C6H15N3O8- + 3 = C8H20N4O10-
By formula: C6H15N3O8- + 3C2H5NO2 = C8H20N4O10-
Quantity | Value | Units | Method | Reference | Comment |
---|---|---|---|---|---|
ΔrH° | 47.3 ± 2.1 | kJ/mol | TDAs | Wincel, 2004 | gas phase |
Quantity | Value | Units | Method | Reference | Comment |
ΔrG° | 10.0 | kJ/mol | TDAs | Wincel, 2004 | gas phase |

Ion clustering data

Data compiled by: John E. Bartmess
Clustering reactions
C4H10N2O6- + 2 = C6H15N3O8-
By formula: C4H10N2O6- + 2C2H5NO2 = C6H15N3O8-
Quantity | Value | Units | Method | Reference | Comment |
---|---|---|---|---|---|
ΔrH° | 53.1 ± 2.1 | kJ/mol | TDAs | Wincel, 2004 | gas phase |
Quantity | Value | Units | Method | Reference | Comment |
ΔrG° | 18.4 | kJ/mol | TDAs | Wincel, 2004 | gas phase |
C6H15N3O8- + 3 = C8H20N4O10-
By formula: C6H15N3O8- + 3C2H5NO2 = C8H20N4O10-
Quantity | Value | Units | Method | Reference | Comment |
---|---|---|---|---|---|
ΔrH° | 47.3 ± 2.1 | kJ/mol | TDAs | Wincel, 2004 | gas phase |
Quantity | Value | Units | Method | Reference | Comment |
ΔrG° | 10.0 | kJ/mol | TDAs | Wincel, 2004 | gas phase |

References

Wincel, 2004
Wincel, H.,
Gas-phase clustering reactions of NO2-, C2H3NO2-, C2H4NO2-C2H5NO2- and C2H5NO4- with C2H5NO2,
Int. J. Mass Spectrom., 2004, 232, 2, 185-194, https://doi.org/10.1016/j.ijms.2004.01.003
. [all data]