(EtNO2)4..NO2 anion
- Formula: C8H20N5O10-
- Molecular weight: 346.2724

Gas phase thermochemistry data

Data compiled by: John E. Bartmess
Quantity | Value | Units | Method | Reference | Comment |
---|---|---|---|---|---|
ΔfH°gas | -195.5 ± 1.1 | kcal/mol | Ther | Wincel, 2004 |

Reaction thermochemistry data

Data compiled by: John E. Bartmess
Individual Reactions
C6H15N4O8- + 4 = C8H20N5O10-
By formula: C6H15N4O8- + 4C2H5NO2 = C8H20N5O10-
Quantity | Value | Units | Method | Reference | Comment |
---|---|---|---|---|---|
ΔrH° | 11.00 ± 0.50 | kcal/mol | TDAs | Wincel, 2004 | gas phase |
Quantity | Value | Units | Method | Reference | Comment |
ΔrG° | 2.70 | kcal/mol | TDAs | Wincel, 2004 | gas phase |

Ion clustering data

Data compiled by: John E. Bartmess
Clustering reactions
C6H15N4O8- + 4 = C8H20N5O10-
By formula: C6H15N4O8- + 4C2H5NO2 = C8H20N5O10-
Quantity | Value | Units | Method | Reference | Comment |
---|---|---|---|---|---|
ΔrH° | 11.00 ± 0.50 | kcal/mol | TDAs | Wincel, 2004 | gas phase |
Quantity | Value | Units | Method | Reference | Comment |
ΔrG° | 2.70 | kcal/mol | TDAs | Wincel, 2004 | gas phase |

References

Wincel, 2004
Wincel, H.,
Gas-phase clustering reactions of NO2-, C2H3NO2-, C2H4NO2-C2H5NO2- and C2H5NO4- with C2H5NO2,
Int. J. Mass Spectrom., 2004, 232, 2, 185-194, https://doi.org/10.1016/j.ijms.2004.01.003
. [all data]