(EtNO2)3..NO2 anion
- Formula: C6H15N4O8-
- Molecular weight: 271.2058

Gas phase thermochemistry data

Data compiled by: John E. Bartmess
Quantity | Value | Units | Method | Reference | Comment |
---|---|---|---|---|---|
ΔfH°gas | -160.07 ± 0.92 | kcal/mol | Ther | Wincel, 2004 |

Ion clustering data

Data compiled by: John E. Bartmess
Clustering reactions
C4H10N3O6- + 3 = C6H15N4O8-
By formula: C4H10N3O6- + 3C2H5NO2 = C6H15N4O8-
Quantity | Value | Units | Method | Reference | Comment |
---|---|---|---|---|---|
ΔrH° | 11.80 ± 0.50 | kcal/mol | TDAs | Wincel, 2004 | gas phase |
Quantity | Value | Units | Method | Reference | Comment |
ΔrG° | 4.00 | kcal/mol | TDAs | Wincel, 2004 | gas phase |
C6H15N4O8- + 4 = C8H20N5O10-
By formula: C6H15N4O8- + 4C2H5NO2 = C8H20N5O10-
Quantity | Value | Units | Method | Reference | Comment |
---|---|---|---|---|---|
ΔrH° | 11.00 ± 0.50 | kcal/mol | TDAs | Wincel, 2004 | gas phase |
Quantity | Value | Units | Method | Reference | Comment |
ΔrG° | 2.70 | kcal/mol | TDAs | Wincel, 2004 | gas phase |

References

Wincel, 2004
Wincel, H.,
Gas-phase clustering reactions of NO2-, C2H3NO2-, C2H4NO2-C2H5NO2- and C2H5NO4- with C2H5NO2,
Int. J. Mass Spectrom., 2004, 232, 2, 185-194, https://doi.org/10.1016/j.ijms.2004.01.003
. [all data]