(EtNO2)2..NO2 anion

Gas phase thermochemistry data

Data compiled by: John E. Bartmess

Quantity Value Units Method Reference Comment
Δfgas-518.1 ± 3.2kJ/molTherWincel, 2004

References

Wincel, 2004
Wincel, H., Gas-phase clustering reactions of NO2-, C2H3NO2-, C2H4NO2-C2H5NO2- and C2H5NO4- with C2H5NO2, Int. J. Mass Spectrom., 2004, 232, 2, 185-194, https://doi.org/10.1016/j.ijms.2004.01.003 . [all data]