EtNO2..NO2 anion
- Formula: C2H5N2O4-
- Molecular weight: 121.0726

Gas phase thermochemistry data

Data compiled by: John E. Bartmess
Quantity | Value | Units | Method | Reference | Comment |
---|---|---|---|---|---|
ΔfH°gas | -84.47 ± 0.55 | kcal/mol | Ther | Wincel, 2004 |

Ion clustering data

Data compiled by: John E. Bartmess
Clustering reactions
C2H5N2O4- + 2 = C4H10N3O6-
By formula: C2H5N2O4- + 2C2H5NO2 = C4H10N3O6-
Quantity | Value | Units | Method | Reference | Comment |
---|---|---|---|---|---|
ΔrH° | 14.90 ± 0.50 | kcal/mol | TDAs | Wincel, 2004 | gas phase |
Quantity | Value | Units | Method | Reference | Comment |
ΔrG° | 6.80 | kcal/mol | TDAs | Wincel, 2004 | gas phase |
By formula: NO2- + C2H5NO2 = C2H5N2O4-
Quantity | Value | Units | Method | Reference | Comment |
---|---|---|---|---|---|
ΔrH° | 15.80 ± 0.50 | kcal/mol | TDAs | Wincel, 2004 | gas phase |
Quantity | Value | Units | Method | Reference | Comment |
ΔrG° | 8.90 | kcal/mol | TDAs | Wincel, 2004 | gas phase |

References

Wincel, 2004
Wincel, H.,
Gas-phase clustering reactions of NO2-, C2H3NO2-, C2H4NO2-C2H5NO2- and C2H5NO4- with C2H5NO2,
Int. J. Mass Spectrom., 2004, 232, 2, 185-194, https://doi.org/10.1016/j.ijms.2004.01.003
. [all data]