PhSiF2H..F anion

Reaction thermochemistry data

Data compiled by: John E. Bartmess

Individual Reactions

Fluorine anion + CAS Reg. No. 696-35-5 = C6H6F3Si-

By formula: F- + CAS Reg. No. 696-35-5 = C6H6F3Si-

Quantity Value Units Method Reference Comment
Δr800.65kJ/molN/AKrouse, Lardin, et al., 2003gas phase

References

Krouse, Lardin, et al., 2003
Krouse, I.H.; Lardin, H.A.; Wenthold, P.G., Gas-phase ion chemistry and ion thermochemistry of phenyltrifluorosilane, Int. J. Mass Spectrom., 2003, 227, 3, 303-314, https://doi.org/10.1016/S1387-3806(03)00080-0 . [all data]