PhSiF3..MeO anion
- Formula: C7H8F3OSi-
- Molecular weight: 193.2191

Reaction thermochemistry data

Data compiled by: John E. Bartmess
Individual Reactions
CH3O- + = C7H8F3OSi-
By formula: CH3O- + C6H5F3Si = C7H8F3OSi-
Quantity | Value | Units | Method | Reference | Comment |
---|---|---|---|---|---|
ΔrH° | 320. ± 25. | kJ/mol | CIDT | Krouse, Lardin, et al., 2003 | gas phase |

Ion clustering data

Data compiled by: John E. Bartmess
Clustering reactions
CH3O- + = C7H8F3OSi-
By formula: CH3O- + C6H5F3Si = C7H8F3OSi-
Quantity | Value | Units | Method | Reference | Comment |
---|---|---|---|---|---|
ΔrH° | 320. ± 25. | kJ/mol | CIDT | Krouse, Lardin, et al., 2003 | gas phase |

Gas phase thermochemistry data

Data compiled by: John E. Bartmess
Quantity | Value | Units | Method | Reference | Comment |
---|---|---|---|---|---|
ΔfH°gas | -1528. ± 26. | kJ/mol | Ther | Krouse, Lardin, et al., 2003 |

References

Krouse, Lardin, et al., 2003
Krouse, I.H.; Lardin, H.A.; Wenthold, P.G.,
Gas-phase ion chemistry and ion thermochemistry of phenyltrifluorosilane,
Int. J. Mass Spectrom., 2003, 227, 3, 303-314, https://doi.org/10.1016/S1387-3806(03)00080-0
. [all data]