PhSiF3..H anion
- Formula: C6H6F3Si-
- Molecular weight: 163.1931

Reaction thermochemistry data

Data compiled by: John E. Bartmess
Individual Reactions
By formula: H- + C6H5F3Si = C6H6F3Si-
Quantity | Value | Units | Method | Reference | Comment |
---|---|---|---|---|---|
ΔrH° | 268. ± 13. | kJ/mol | CIDT | Krouse, Lardin, et al., 2003 | gas phase |

Ion clustering data

Data compiled by: John E. Bartmess
Clustering reactions
By formula: H- + C6H5F3Si = C6H6F3Si-
Quantity | Value | Units | Method | Reference | Comment |
---|---|---|---|---|---|
ΔrH° | 268. ± 13. | kJ/mol | CIDT | Krouse, Lardin, et al., 2003 | gas phase |

Gas phase thermochemistry data

Data compiled by: John E. Bartmess
Quantity | Value | Units | Method | Reference | Comment |
---|---|---|---|---|---|
ΔfH°gas | -1200.0 | kJ/mol | Ther | Krouse, Lardin, et al., 2003 |

References

Krouse, Lardin, et al., 2003
Krouse, I.H.; Lardin, H.A.; Wenthold, P.G.,
Gas-phase ion chemistry and ion thermochemistry of phenyltrifluorosilane,
Int. J. Mass Spectrom., 2003, 227, 3, 303-314, https://doi.org/10.1016/S1387-3806(03)00080-0
. [all data]