HNiCO anion

Gas phase ion energetics data

Data compiled by: John E. Bartmess

Electron affinity of neutral species

EAneutral (eV) Method Reference Comment
2.126 ± 0.010LPESChatterjee, Akin, et al., 2003

References

Chatterjee, Akin, et al., 2003
Chatterjee, B.; Akin, F.A.; Jarrold, C.C.; Raghavachari, K., A comparison of stable carbonyls formed in the gas-phase reaction between group 10 atomic anions and methanol or methoxy radi, J. Chem. Phys., 2003, 119, 20, 10591-10599, https://doi.org/10.1063/1.1619131 . [all data]