nHxCH=C(Me)O anion
- Formula: C9H17O-
- Molecular weight: 141.2312

Gas phase ion energetics data

Data compiled by: John E. Bartmess
Protonation reactions
By formula: C9H17O- + H+ = C9H18O
Quantity | Value | Units | Method | Reference | Comment |
---|---|---|---|---|---|
ΔrH° | 364.2 ± 2.2 | kcal/mol | TDEq | Burkell, Fridgen, et al., 2003 | gas phase |
Quantity | Value | Units | Method | Reference | Comment |
ΔrG° | 357.3 ± 2.1 | kcal/mol | TDEq | Burkell, Fridgen, et al., 2003 | gas phase |

Reaction thermochemistry data

Data compiled by: John E. Bartmess

Individual Reactions

C9H17O- + Hydrogen cation = 2-Nonanone

By formula: C9H17O- + H+ = C9H18O

Quantity Value Units Method Reference Comment
Δr1524. ± 9.2kJ/molTDEqBurkell, Fridgen, et al., 2003gas phase
Quantity Value Units Method Reference Comment
Δr1495. ± 8.8kJ/molTDEqBurkell, Fridgen, et al., 2003gas phase

References

Burkell, Fridgen, et al., 2003
Burkell, J.L.; Fridgen, T.D.; McMahon, T.B.,
Gas-phase acidities and sites of deprotonation of 2-ketones and structures of the corresponding enolates,
Int. J. Mass Spectrom., 2003, 227, 3, 497-508, https://doi.org/10.1016/S1387-3806(03)00102-7
. [all data]