5-CO2-N-Me-pyridinium-3-ide anion

Gas phase ion energetics data

Data compiled by: John E. Bartmess

Electron affinity of neutral species

EAneutral (eV) Method Reference Comment
2.820 ± 0.050LPESWang, Dacres, et al., 2003From 3,5-di(CO2-)-N-Me-pyridinium. EA is for carbanion site.

References

Wang, Dacres, et al., 2003
Wang, X.B.; Dacres, J.E.; Yang, X.; Lis, L.; Bedell, V.M.; Wang, L.S.; Kass, S.R., Photodetachment of zwitterions: Probing intramolecular Coulomb repulsion and attraction in the gas phase using mono- decarboxylated pyridinium dicarboxylates. Implications on the mechanism o, J. Am. Chem. Soc., 2003, 125, 22, 6814-6826, https://doi.org/10.1021/ja0290835 . [all data]