4-CO2-pyridinium-N-CH2 anion

Gas phase ion energetics data

Data compiled by: John E. Bartmess

Electron affinity of neutral species

EAneutral (eV) Method Reference Comment
2.955 ± 0.010LPESWang, Dacres, et al., 2003Rearrangment product from 2,4-di(CO2-)-N-Me-pyridinium. EA is for carbanion site.
2.960 ± 0.010LPESWang, Dacres, et al., 2003Rearrangment product from 3,4-di(CO2-)-N-Me-pyridinium. EA is for carbanion site.
3.45 ± 0.10LPESWang, Dacres, et al., 2003Rearrangment product from 2,4-di(CO2-)-N-Me-pyridinium. EA is for carboxylate site. Vertical Detachment Energy = 3.95±0.1 eV
3.85 ± 0.10LPESWang, Dacres, et al., 2003From 4-(CO2-)-N-CH2CO2-pyridinium. EA is for carboxylate site. Vertical Detachment Energy = 4.22±0.10 eV
2.960 ± 0.010LPESWang, Dacres, et al., 2003From 4-(CO2-)-N-CH2CO2-pyridinium. EA is for carbanion site.
3.35 ± 0.10LPESWang, Dacres, et al., 2003Rearrangment product from 3,4-di(CO2-)-N-Me-pyridinium. EA is for carboxylate site. Vertical Detachment Energy = 3.77±0.1 eV

References

Wang, Dacres, et al., 2003
Wang, X.B.; Dacres, J.E.; Yang, X.; Lis, L.; Bedell, V.M.; Wang, L.S.; Kass, S.R., Photodetachment of zwitterions: Probing intramolecular Coulomb repulsion and attraction in the gas phase using mono- decarboxylated pyridinium dicarboxylates. Implications on the mechanism o, J. Am. Chem. Soc., 2003, 125, 22, 6814-6826, https://doi.org/10.1021/ja0290835 . [all data]